BDBM50123370 2-(4-Acetyl-3,4-dihydro-2H-benzo[1,4]oxazin-6-yl)-7-methoxy-6-oxazol-5-yl-1H-quinolin-4-one::CHEMBL357949
SMILES COc1cc2nc(cc(O)c2cc1-c1cnco1)-c1ccc2OCCN(C(C)=O)c2c1
InChI Key InChIKey=BHEYLEPHDVEWRS-UHFFFAOYSA-N
Data  1 IC50
  Tab Delimited (TSV)   2D SDfile   Computed 3D by Vconf -m prep SDfile
Find this compound or compounds like it in BindingDB:
Activity Spreadsheet -- Enzyme Inhibition Constant Data from BindingDB
Found 1 hit for monomerid = 50123370
TargetInosine-5'-monophosphate dehydrogenase 2(Homo sapiens (Human))
Bristol-Myers Squibb Pri
Curated by ChEMBL
LigandPNGBDBM50123370(2-(4-Acetyl-3,4-dihydro-2H-benzo[1,4]oxazin-6-yl)-...)
Affinity DataIC50:  14nM. Assay description: Inhibitory activity against inosine monophosphate dehydrogenase IMPDH II
In DepthDetails ArticlePubMed