BDBM50123410 3-{5-[({4-[1-(1-Imino-ethyl)-piperidin-4-yloxy]-phenyl}-methanesulfonyl-amino)-methyl]-3-methyl-pyrazol-1-yl}-benzamidine::CHEMBL152018
SMILES CC(=N)N1CCC(CC1)Oc1ccc(cc1)N(Cc1cc(C)nn1-c1cccc(c1)C(N)=N)S(C)(=O)=O
InChI Key InChIKey=FIVLNKNLIFYQSP-UHFFFAOYSA-N
Data  3 IC50
  Tab Delimited (TSV)   2D SDfile   Computed 3D by Vconf -m prep SDfile
Find this compound or compounds like it in BindingDB:
Activity Spreadsheet -- Enzyme Inhibition Constant Data from BindingDB
Found 3 hits for monomerid = 50123410
TargetCoagulation factor X(Homo sapiens (Human))
Millennium Pharmaceuticals
Curated by ChEMBL
LigandPNGBDBM50123410(3-{5-[({4-[1-(1-Imino-ethyl)-piperidin-4-yloxy]-ph...)
Affinity DataIC50:  6.92E+3nM. Assay description: Inhibitory concentration of the compound to factor Xa
In DepthDetails ArticlePubMed
TargetAnionic trypsin-2(Rattus norvegicus)
Millennium Pharmaceuticals
Curated by ChEMBL
LigandPNGBDBM50123410(3-{5-[({4-[1-(1-Imino-ethyl)-piperidin-4-yloxy]-ph...)
Affinity DataIC50: >1.00E+4nM. Assay description: Inhibitory concentration of the compound against trypsin
In DepthDetails ArticlePubMed
TargetProthrombin(Homo sapiens (Human))
Millennium Pharmaceuticals
Curated by ChEMBL
LigandPNGBDBM50123410(3-{5-[({4-[1-(1-Imino-ethyl)-piperidin-4-yloxy]-ph...)
Affinity DataIC50: >1.00E+4nM. Assay description: Inhibition of factor II
In DepthDetails ArticlePubMed