BDBM50123643 6-benzyloxy-8-(tert-butyl)-9,12,17-trihydroxy-16-methyl-(6R,8R,9R,12R,16S,17R)-2,4,14,19-tetraoxahexacyclo[8.7.2.01,11.03,7.07,11.013,17]nonadecane-5,15,18-trione::CHEMBL347597
SMILES C[C@@H]1C(=O)OC2[C@H](O)C34C5OC(=O)C3(OC3OC(=O)[C@H](OCc6ccccc6)C43C([C@H]5O)C(C)(C)C)[C@@]12O
InChI Key InChIKey=YPOMAFCMSAKBRX-HMWBYDIESA-N
Data  1 KI
  Tab Delimited (TSV)   2D SDfile   Computed 3D by Vconf -m prep SDfile
Find this compound or compounds like it in BindingDB:
Activity Spreadsheet -- Enzyme Inhibition Constant Data from BindingDB
Found 1 hit for monomerid = 50123643
TargetPlatelet-activating factor receptor(Cavia porcellus)
Columbia University
Curated by ChEMBL
LigandPNGBDBM50123643(6-benzyloxy-8-(tert-butyl)-9,12,17-trihydroxy-16-m...)
Affinity DataKi:  600nM. Assay description: Displacement of [3H]-WEB 2086 from Platelet activating factor receptor (guinea pig) transgenic mouse muscle membrane
In DepthDetails ArticlePubMed