BDBM50123693 4-Bromo-1-(2-chloro-phenyl)-5-(4-methoxy-phenyl)-1H-pyrazole-3-carboxylic acid piperidin-1-ylamide::CHEMBL156146
SMILES COc1ccc(cc1)-c1c(Br)c(nn1-c1ccccc1Cl)C(=O)NN1CCCCC1
InChI Key InChIKey=DTAKPJGTAAJOSF-UHFFFAOYSA-N
Data  1 KI
  Tab Delimited (TSV)   2D SDfile   Computed 3D by Vconf -m prep SDfile
Find this compound or compounds like it in BindingDB:
Activity Spreadsheet -- Enzyme Inhibition Constant Data from BindingDB
Found 1 hit for monomerid = 50123693
TargetCannabinoid receptor 1(Rattus norvegicus (rat))
National Institute On Drug Abuse
Curated by ChEMBL
LigandPNGBDBM50123693(4-Bromo-1-(2-chloro-phenyl)-5-(4-methoxy-phenyl)-1...)
Affinity DataKi:  6.20nM. Assay description: Binding affinity was determined by using a competition assay with [125 I]- AM251 against rat cannabinoid receptor 1
In DepthDetails ArticlePubMed