BDBM50123771 4-(6-Chloro-benzo[b]thiophene-2-sulfonyl)-1-furo[3,2-c]pyridin-2-ylmethyl-piperazin-2-one::CHEMBL351435
SMILES Clc1ccc2cc(sc2c1)S(=O)(=O)N1CCN(Cc2cc3cnccc3o2)C(=O)C1
InChI Key InChIKey=CTFPGRYHAAMXHC-UHFFFAOYSA-N
Data  3 KI
  Tab Delimited (TSV)   2D SDfile   Computed 3D by Vconf -m prep SDfile
Find this compound or compounds like it in BindingDB:
Activity Spreadsheet -- Enzyme Inhibition Constant Data from BindingDB
Found 3 hits for monomerid = 50123771
TargetCoagulation factor X(Homo sapiens (Human))
Aventis Pharmaceuticals
Curated by ChEMBL
LigandPNGBDBM50123771(4-(6-Chloro-benzo[b]thiophene-2-sulfonyl)-1-furo[3...)
Affinity DataKi:  1.22E+3nM. Assay description: In vitro binding affinity for human Coagulation factor X
In DepthDetails ArticlePubMed
TargetSerine protease 1(Homo sapiens (Human))
Aventis Pharmaceuticals
Curated by ChEMBL
LigandPNGBDBM50123771(4-(6-Chloro-benzo[b]thiophene-2-sulfonyl)-1-furo[3...)
Affinity DataKi: >2.90E+3nM. Assay description: Binding affinity towards trypsin
In DepthDetails ArticlePubMed
TargetProthrombin(Homo sapiens (Human))
Aventis Pharmaceuticals
Curated by ChEMBL
LigandPNGBDBM50123771(4-(6-Chloro-benzo[b]thiophene-2-sulfonyl)-1-furo[3...)
Affinity DataKi: >3.90E+3nM. Assay description: Binding affinity towards thrombin
In DepthDetails ArticlePubMed