BDBM50123773 4-(Benzo[b]thiophene-2-sulfonyl)-1-(1H-pyrrolo[3,2-c]pyridin-2-ylmethyl)-piperazin-2-one::CHEMBL347406
SMILES O=C1CN(CCN1Cc1cc2cnccc2[nH]1)S(=O)(=O)c1cc2ccccc2s1
InChI Key InChIKey=DBMCFCZDENQJRR-UHFFFAOYSA-N
Data  1 KI
  Tab Delimited (TSV)   2D SDfile   Computed 3D by Vconf -m prep SDfile
Find this compound or compounds like it in BindingDB:
Activity Spreadsheet -- Enzyme Inhibition Constant Data from BindingDB
Found 1 hit for monomerid = 50123773
TargetCoagulation factor X(Homo sapiens (Human))
Aventis Pharmaceuticals
Curated by ChEMBL
LigandPNGBDBM50123773(4-(Benzo[b]thiophene-2-sulfonyl)-1-(1H-pyrrolo[3,2...)
Affinity DataKi:  959nM. Assay description: In vitro binding affinity for human Coagulation factor X
In DepthDetails ArticlePubMed