BDBM50123797 5-Bromo-N-(1,4-diethyl-[1,4]diazepan-6-yl)-2-methoxy-6-methylamino-nicotinamide::CHEMBL349050
SMILES CCN1CCN(CC)CC(C1)NC(=O)c1cc(Br)c(NC)nc1OC
InChI Key InChIKey=ZSKNMSUICFBPDZ-UHFFFAOYSA-N
Data  2 IC50
  Tab Delimited (TSV)   2D SDfile   Computed 3D by Vconf -m prep SDfile
Find this compound or compounds like it in BindingDB:
Activity Spreadsheet -- Enzyme Inhibition Constant Data from BindingDB
Found 2 hits for monomerid = 50123797
TargetD(2) dopamine receptor(Rattus norvegicus (rat))
Dainippon Pharmaceutical
Curated by ChEMBL
LigandPNGBDBM50123797(5-Bromo-N-(1,4-diethyl-[1,4]diazepan-6-yl)-2-metho...)
Affinity DataIC50:  20.9nM. Assay description: Inhibition of the binding of radioligand [3H]spiperone to dopamine receptor D2 in rat brain synaptic membrane
In DepthDetails ArticlePubMed
Target5-hydroxytryptamine receptor 3A/3B(Rattus norvegicus)
Dainippon Pharmaceutical
Curated by ChEMBL
LigandPNGBDBM50123797(5-Bromo-N-(1,4-diethyl-[1,4]diazepan-6-yl)-2-metho...)
Affinity DataIC50:  0.590nM. Assay description: Concentration required to inhibit the binding of radioligand [3H]GR-65630 to serotonin 5-hydroxytryptamine-3 receptor (5-HT 3 receptor)in rat brain c...
In DepthDetails ArticlePubMed