BDBM50123808 CHEMBL3623372
SMILES CN(C)CCNC(=O)c1csc2nc(cn12)-c1ccc(NC(=O)Nc2cc(on2)C(C)(C)C)cc1
InChI Key InChIKey=GQTFZUMOXXOGDM-UHFFFAOYSA-N
Data  1 IC50
  Tab Delimited (TSV)   2D SDfile   Computed 3D by Vconf -m prep SDfile
Find this compound or compounds like it in BindingDB:
Activity Spreadsheet -- Enzyme Inhibition Constant Data from BindingDB
Found 1 hit for monomerid = 50123808
TargetReceptor-type tyrosine-protein kinase FLT3(Homo sapiens (Human))
Sichuan University
Curated by ChEMBL
LigandPNGBDBM50123808(CHEMBL3623372)
Affinity DataIC50:  22nM. Assay description: Inhibition of human recombinant Flt3
In DepthDetails ArticlePubMed