BDBM50124112 (E)-3-[4-(2,6-Dichloro-benzoylamino)-phenyl]-2-(2,2-dimethyl-propionylamino)-acrylic acid::(Z)-3-[4-(2,6-Dichloro-benzoylamino)-phenyl]-2-(2,2-dimethyl-propionylamino)-acrylic acid::CHEMBL166477
SMILES CC(C)(C)C(=O)N\C(=C\c1ccc(NC(=O)c2c(Cl)cccc2Cl)cc1)C(O)=O
InChI Key InChIKey=TZHPMUDTJGJDTC-LFIBNONCSA-N
Data  2 IC50
  Tab Delimited (TSV)   2D SDfile   Computed 3D by Vconf -m prep SDfile
Find this compound or compounds like it in BindingDB:
Activity Spreadsheet -- Enzyme Inhibition Constant Data from BindingDB
Found 2 hits for monomerid = 50124112
TargetIntegrin alpha-4/beta-1(Homo sapiens (Human))
Celltech R&D
Curated by ChEMBL
LigandPNGBDBM50124112((E)-3-[4-(2,6-Dichloro-benzoylamino)-phenyl]-2-(2,...)
Affinity DataIC50:  80nM. Assay description: Inhibition of VLA-4 to VCAM-1 binding in Jurkat cell adhesion assay
In DepthDetails ArticlePubMed
TargetIntegrin alpha-4/beta-1(Homo sapiens (Human))
Celltech R&D
Curated by ChEMBL
LigandPNGBDBM50124112((E)-3-[4-(2,6-Dichloro-benzoylamino)-phenyl]-2-(2,...)
Affinity DataIC50:  2.70nM. Assay description: Inhibition of VLA-4 to VCAM-1 binding in Jurkat cell adhesion assay
In DepthDetails ArticlePubMed