BDBM50124115 (E)-2-[((S)-3-Acetyl-thiazolidine-4-carbonyl)-amino]-3-{4-[(3,5-dichloro-pyridine-4-carbonyl)-amino]-phenyl}-acrylic acid::CHEMBL167007
SMILES CC(=O)N1CSC[C@@H]1C(=O)N\C(=C\c1ccc(NC(=O)c2c(Cl)cncc2Cl)cc1)C(O)=O
InChI Key InChIKey=CPWXAEABNBAWBW-UMNNMYMZSA-N
Data  2 IC50
  Tab Delimited (TSV)   2D SDfile   Computed 3D by Vconf -m prep SDfile
Find this compound or compounds like it in BindingDB:
Activity Spreadsheet -- Enzyme Inhibition Constant Data from BindingDB
Found 2 hits for monomerid = 50124115
TargetIntegrin alpha-4/beta-1(Homo sapiens (Human))
Celltech R&D
Curated by ChEMBL
LigandPNGBDBM50124115((E)-2-[((S)-3-Acetyl-thiazolidine-4-carbonyl)-amin...)
Affinity DataIC50:  200nM. Assay description: Inhibition of VLA-4 to VCAM-1 binding in Jurkat cell adhesion assay
In DepthDetails ArticlePubMed
TargetIntegrin alpha-4/beta-1(Homo sapiens (Human))
Celltech R&D
Curated by ChEMBL
LigandPNGBDBM50124115((E)-2-[((S)-3-Acetyl-thiazolidine-4-carbonyl)-amin...)
Affinity DataIC50:  60nM. Assay description: Inhibition of VLA-4 to VCAM-1 binding
In DepthDetails ArticlePubMed