BDBM50124184 CHEMBL354981::[(3aS,5S,5aR,8aR,8bS)-2,2,7,7-tetramethyltetrahydro-3aH-bis[1,3]dioxolo[4,5-b:4',5'-d]pyran-5-yl]methyl sulfamate
SMILES CC1(C)O[C@@H]2O[C@@H](COS(N)(=O)=O)[C@H]3OC(C)(C)O[C@H]3[C@@H]2O1
InChI Key InChIKey=QJGSPKFACUOMJQ-MBXMOIHESA-N
Data  3 KI
  Tab Delimited (TSV)   2D SDfile   Computed 3D by Vconf -m prep SDfile
Find this compound or compounds like it in BindingDB:
Activity Spreadsheet -- Enzyme Inhibition Constant Data from BindingDB
Found 3 hits for monomerid = 50124184
TargetCarbonic anhydrase 2(Homo sapiens (Human))
Universit£
Curated by ChEMBL
LigandPNGBDBM50124184(CHEMBL354981 | [(3aS,5S,5aR,8aR,8bS)-2,2,7,7-tetra...)
Affinity DataKi:  1.30E+4nM. Assay description: Inhibitory activity against human cloned carbonic anhydrase II (hCA II)
In DepthDetails ArticlePubMed
TargetCarbonic anhydrase 4(Bos taurus (bovine))
Universit£
Curated by ChEMBL
LigandPNGBDBM50124184(CHEMBL354981 | [(3aS,5S,5aR,8aR,8bS)-2,2,7,7-tetra...)
Affinity DataKi:  2.70E+4nM. Assay description: Inhibitory activity against carbonic anhydrase isolated from bovine lung microsome (bCA IV)
In DepthDetails ArticlePubMed
TargetCarbonic anhydrase 1(Homo sapiens (Human))
Universit£
Curated by ChEMBL
LigandPNGBDBM50124184(CHEMBL354981 | [(3aS,5S,5aR,8aR,8bS)-2,2,7,7-tetra...)
Affinity DataKi:  4.00E+5nM. Assay description: Inhibitory activity against human cloned carbonic anhydrase I (hCA I)
In DepthDetails ArticlePubMed