BDBM50124204 5-Vinyl-1H-pyrimidine-2,4-dione::CHEMBL170188
SMILES C=Cc1c[nH]c(=O)[nH]c1=O
InChI Key InChIKey=ZRYZBEQILKESAW-UHFFFAOYSA-N
Data  1 IC50
  Tab Delimited (TSV)   2D SDfile   Computed 3D by Vconf -m prep SDfile
Find this compound or compounds like it in BindingDB:
Activity Spreadsheet -- Enzyme Inhibition Constant Data from BindingDB
Found 1 hit for monomerid = 50124204
TargetDihydropyrimidine dehydrogenase [NADP(+)](Homo sapiens (Human))
Nippon Roche Research Center
Curated by ChEMBL
LigandPNGBDBM50124204(5-Vinyl-1H-pyrimidine-2,4-dione | CHEMBL170188)
Affinity DataIC50:  89nM. Assay description: Inhibitory activity of the compound against dihydropyrimidine dehydrogenase (DPD)
In DepthDetails ArticlePubMed