BDBM50124532 CHEMBL366978::ethyl 4'-amino-5'-chlorospiro[hexahydropyridine-4,2'-(1',2'-dihydroquinazoline)]-1-carboxylate
SMILES CCOC(=O)N1CCC2(CC1)Nc1cccc(Cl)c1C(N)=N2
InChI Key InChIKey=UTCXKRXHURSMMU-UHFFFAOYSA-N
Data  1 IC50
  Tab Delimited (TSV)   2D SDfile   Computed 3D by Vconf -m prep SDfile
Find this compound or compounds like it in BindingDB:
Activity Spreadsheet -- Enzyme Inhibition Constant Data from BindingDB
Found 1 hit for monomerid = 50124532
TargetNitric oxide synthase, inducible(Homo sapiens (Human))
Astrazeneca R&D Charnwood
Curated by ChEMBL
LigandPNGBDBM50124532(CHEMBL366978 | ethyl 4'-amino-5'-chlorospiro[hexah...)
Affinity DataIC50:  47nM. Assay description: Inhibitory activity of compound against human inducible nitiric oxide synthase
In DepthDetails ArticlePubMed