BDBM50124770 (S)-2-{(S)-2-[(S)-2-Butyrylamino-3-(3H-imidazol-4-yl)-propionylamino]-3-phenyl-propionylamino}-5-guanidino-pentanoic acid [(S)-1-(carbamoylmethyl-carbamoyl)-2-(1H-indol-3-yl)-ethyl]-amide::CHEMBL349298
SMILES CCCC(=O)N[C@@H](Cc1cnc[nH]1)C(=O)N[C@@H](Cc1ccccc1)C(=O)N[C@@H](CCCNC(N)=N)C(=O)N[C@@H](Cc1c[nH]c2ccccc12)C(=O)NCC(N)=O
InChI Key InChIKey=LVACOVVOTCZAIW-ORYMTKCHSA-N
Data  2 IC50  2 EC50
  Tab Delimited (TSV)   2D SDfile   Computed 3D by Vconf -m prep SDfile
Find this compound or compounds like it in BindingDB:
Activity Spreadsheet -- Enzyme Inhibition Constant Data from BindingDB
Found 4 hits for monomerid = 50124770
TargetMelanocortin receptor 4(Homo sapiens (Human))
Roche Research Center
Curated by ChEMBL
LigandPNGBDBM50124770((S)-2-{(S)-2-[(S)-2-Butyrylamino-3-(3H-imidazol-4-...)
Affinity DataIC50:  150nM. Assay description: Inhibitory concentration of compound was determined against hMC4R through displacement of NDP-MSH radioligand using HEK293 cells
In DepthDetails ArticlePubMed
TargetMelanocortin receptor 4(Homo sapiens (Human))
Roche Research Center
Curated by ChEMBL
LigandPNGBDBM50124770((S)-2-{(S)-2-[(S)-2-Butyrylamino-3-(3H-imidazol-4-...)
Affinity DataEC50:  20nM. Assay description: Effective concentration against hMC4R using HEK293 cells was determined by measuring cAMP accumulation
In DepthDetails ArticlePubMed
TargetMelanocyte-stimulating hormone receptor(Homo sapiens (Human))
Roche Research Center
Curated by ChEMBL
LigandPNGBDBM50124770((S)-2-{(S)-2-[(S)-2-Butyrylamino-3-(3H-imidazol-4-...)
Affinity DataIC50:  575nM. Assay description: Effective concentration against hMC4R using HEK293 cells was determined by measuring cAMP accumulation
In DepthDetails ArticlePubMed
TargetMelanocyte-stimulating hormone receptor(Homo sapiens (Human))
Roche Research Center
Curated by ChEMBL
LigandPNGBDBM50124770((S)-2-{(S)-2-[(S)-2-Butyrylamino-3-(3H-imidazol-4-...)
Affinity DataEC50:  10nM. Assay description: Effective concentration against hMC1R using HEK293 cells was determined by measuring the cAMP accumulation
In DepthDetails ArticlePubMed