BDBM50124837 2-[3-(6,8-Dichloro-1,2,3,4-tetrahydro-quinolin-4-ylamino)-propylamino]-1H-quinolin-4-one::CHEMBL347809
SMILES Oc1cc(NCCCNC2CCNc3c(Cl)cc(Cl)cc23)nc2ccccc12
InChI Key InChIKey=FCPSJCDPYVIQGC-UHFFFAOYSA-N
Data  1 IC50
  Tab Delimited (TSV)   2D SDfile   Computed 3D by Vconf -m prep SDfile
Find this compound or compounds like it in BindingDB:
Activity Spreadsheet -- Enzyme Inhibition Constant Data from BindingDB
Found 1 hit for monomerid = 50124837
TargetMethionine--tRNA ligase(Escherichia coli (strain K12))
Glaxosmithkline
Curated by ChEMBL
LigandPNGBDBM50124837(2-[3-(6,8-Dichloro-1,2,3,4-tetrahydro-quinolin-4-y...)
Affinity DataIC50:  23nM. Assay description: Compound tested for inhibition of Staphylococcus aureus MRS (methionyl tRNA synthetase) in aminoacylation assay
In DepthDetails ArticlePubMed