BDBM50125199 (2-Bromo-benzoylamino)-acetic acid::CHEMBL7664
SMILES OC(=O)CNC(=O)c1ccccc1Br
InChI Key InChIKey=FVCGQCONGSANIN-UHFFFAOYSA-N
Data  1 IC50
  Tab Delimited (TSV)   2D SDfile   Computed 3D by Vconf -m prep SDfile
Find this compound or compounds like it in BindingDB:
Activity Spreadsheet -- Enzyme Inhibition Constant Data from BindingDB
Found 1 hit for monomerid = 50125199
TargetIntegrin alpha-L/Integrin beta-2/Intercellular adhesion molecule 1(Homo sapiens (Human))
Genentech
Curated by ChEMBL
LigandPNGBDBM50125199((2-Bromo-benzoylamino)-acetic acid | CHEMBL7664)
Affinity DataIC50:  3.14E+5nM. Assay description: In vitro inhibitory potency for preventing ET-1 induced constriction of rat aortic rings (ETA receptor)
In DepthDetails ArticlePubMed