BDBM50125284 (S)-3-[3'-(3-Propyl-ureido)-biphenyl-4-yl]-2-(toluene-2-sulfonylamino)-propionic acid::CHEMBL276706
SMILES CCCNC(=O)Nc1cccc(c1)-c1ccc(C[C@H](NS(=O)(=O)c2ccccc2C)C(O)=O)cc1
InChI Key InChIKey=OGDFUBCUOQLOFA-QHCPKHFHSA-N
Data  1 KI
  Tab Delimited (TSV)   2D SDfile   Computed 3D by Vconf -m prep SDfile
Find this compound or compounds like it in BindingDB:
Activity Spreadsheet -- Enzyme Inhibition Constant Data from BindingDB
Found 1 hit for monomerid = 50125284
TargetIntegrin alpha-V/beta-3(Homo sapiens (Human))
Bayer
Curated by ChEMBL
LigandPNGBDBM50125284((S)-3-[3'-(3-Propyl-ureido)-biphenyl-4-yl]-2-(tolu...)
Affinity DataKi:  70nM. Assay description: Binding affinity towards vitronectin receptor (alpha V-beta3) was determined
In DepthDetails ArticlePubMed