BDBM50125290 (S)-3-[3'-(3-Cyclopentyl-ureido)-4'-methyl-biphenyl-4-yl]-2-(2,4,6-trimethyl-benzenesulfonylamino)-propionic acid::CHEMBL10784
SMILES Cc1cc(C)c(c(C)c1)S(=O)(=O)N[C@@H](Cc1ccc(cc1)-c1ccc(C)c(NC(=O)NC2CCCC2)c1)C(O)=O
InChI Key InChIKey=LNEUBXLHUNHVBG-NDEPHWFRSA-N
Data  1 KI
  Tab Delimited (TSV)   2D SDfile   Computed 3D by Vconf -m prep SDfile
Find this compound or compounds like it in BindingDB:
Activity Spreadsheet -- Enzyme Inhibition Constant Data from BindingDB
Found 1 hit for monomerid = 50125290
TargetIntegrin alpha-V/beta-3(Homo sapiens (Human))
Bayer
Curated by ChEMBL
LigandPNGBDBM50125290((S)-3-[3'-(3-Cyclopentyl-ureido)-4'-methyl-bipheny...)
Affinity DataKi:  100nM. Assay description: Binding affinity towards vitronectin receptor (alpha V-beta3) was determined
In DepthDetails ArticlePubMed