BDBM50125394 7-Chloro-3,4-dihydro-quinazolin-2-ylamine::CHEMBL13864::CHEMBL538340
SMILES NC1=Nc2cc(Cl)ccc2CN1
InChI Key InChIKey=KIJXVALDJPUIFM-UHFFFAOYSA-N
Data  1 KI
  Tab Delimited (TSV)   2D SDfile   Computed 3D by Vconf -m prep SDfile
Find this compound or compounds like it in BindingDB:
Activity Spreadsheet -- Enzyme Inhibition Constant Data from BindingDB
Found 1 hit for monomerid = 50125394
Target5-hydroxytryptamine receptor 5A(Homo sapiens (Human))
F. Hoffmann-La Roche
Curated by ChEMBL
LigandPNGBDBM50125394(7-Chloro-3,4-dihydro-quinazolin-2-ylamine | CHEMBL...)
Affinity DataKi:  347nM. Assay description: Displacement of [3H]LSD from human recombinant 5HT5A receptor expressed in HEK293-EBNA cells
In DepthDetails ArticlePubMed