BDBM50125451 1-[2-(3-Hydroxy-pyrrolidin-1-yl)-1-phenyl-ethyl]-3-(4-trifluoromethoxy-phenyl)-1H-pyridin-2-one::CHEMBL15498
SMILES OC1CCN(CC(c2ccccc2)n2cccc(-c3ccc(OC(F)(F)F)cc3)c2=O)C1
InChI Key InChIKey=VQLWORQLQXNPGX-UHFFFAOYSA-N
Data  3 IC50
  Tab Delimited (TSV)   2D SDfile   Computed 3D by Vconf -m prep SDfile
Find this compound or compounds like it in BindingDB:
Activity Spreadsheet -- Enzyme Inhibition Constant Data from BindingDB
Found 3 hits for monomerid = 50125451
TargetDelta-type opioid receptor(Homo sapiens (Human))
Astrazeneca R&D
Curated by ChEMBL
LigandPNGBDBM50125451(1-[2-(3-Hydroxy-pyrrolidin-1-yl)-1-phenyl-ethyl]-3...)
Affinity DataIC50: >1.00E+4nM. Assay description: Inhibition of [125I]-Deltorphin binding to human delta opioid receptor from membranes of HEK293 cells
In DepthDetails ArticlePubMed
TargetMu-type opioid receptor(Homo sapiens (Human))
Astrazeneca R&D
Curated by ChEMBL
LigandPNGBDBM50125451(1-[2-(3-Hydroxy-pyrrolidin-1-yl)-1-phenyl-ethyl]-3...)
Affinity DataIC50: >5.00E+3nM. Assay description: Inhibition of [125I]-Enkephalin binding to human mu opioid receptor from membranes of HEK293 cells
In DepthDetails ArticlePubMed
TargetKappa-type opioid receptor(Homo sapiens (Human))
Astrazeneca R&D
Curated by ChEMBL
LigandPNGBDBM50125451(1-[2-(3-Hydroxy-pyrrolidin-1-yl)-1-phenyl-ethyl]-3...)
Affinity DataIC50:  7.60nM. Assay description: Inhibition of [125I]-(D-Pro10)-Dynorphin A binding to human kappa opioid receptor from membranes of HEK293 cells
In DepthDetails ArticlePubMed