BDBM50125750 CHEMBL13910::N-[1-[2-(4-Butyryl-4-phenyl-piperidin-1-yl)-1-(4-methoxy-benzyl)-2-oxo-ethylcarbamoyl]-2-(1H-imidazol-4-yl)-ethyl]-benzamide
SMILES CCCC(=O)C1(CCN(CC1)C(=O)[C@@H](Cc1ccc(OC)cc1)NC(=O)[C@@H](Cc1cnc[nH]1)NC(=O)c1ccccc1)c1ccccc1
InChI Key InChIKey=LNJORQHQDHIPBT-CZNDPXEESA-N
Data  1 IC50  4 EC50
  Tab Delimited (TSV)   2D SDfile   Computed 3D by Vconf -m prep SDfile
Find this compound or compounds like it in BindingDB:
Activity Spreadsheet -- Enzyme Inhibition Constant Data from BindingDB
Found 5 hits for monomerid = 50125750
TargetMelanocortin receptor 3(Homo sapiens (Human))
Bristol-Myers Squibb Pharmaceutical Research Institute
Curated by ChEMBL
LigandPNGBDBM50125750(CHEMBL13910 | N-[1-[2-(4-Butyryl-4-phenyl-piperidi...)
Affinity DataEC50:  250nM. Assay description: In vitro effective concentration towards human Melanocortin 3 receptor (MC3R) was determined by a SPA-based cAMP assay in melanoma cells
In DepthDetails ArticlePubMed
TargetMelanocyte-stimulating hormone receptor(Homo sapiens (Human))
Bristol-Myers Squibb Pharmaceutical Research Institute
Curated by ChEMBL
LigandPNGBDBM50125750(CHEMBL13910 | N-[1-[2-(4-Butyryl-4-phenyl-piperidi...)
Affinity DataIC50:  3.10nM. Assay description: In vitro inhibitory concentration of the compound against human Melanocortin 1 receptor (MC1R)
In DepthDetails ArticlePubMed
TargetMelanocortin receptor 5(Homo sapiens (Human))
Bristol-Myers Squibb Pharmaceutical Research Institute
Curated by ChEMBL
LigandPNGBDBM50125750(CHEMBL13910 | N-[1-[2-(4-Butyryl-4-phenyl-piperidi...)
Affinity DataEC50:  2.10E+3nM. Assay description: In vitro effective concentration towards human Melanocortin 5 receptor (MC5R) was determined by a SPA-based cAMP assay in melanoma cells
In DepthDetails ArticlePubMed
TargetMelanocortin receptor 4(Homo sapiens (Human))
Bristol-Myers Squibb Pharmaceutical Research Institute
Curated by ChEMBL
LigandPNGBDBM50125750(CHEMBL13910 | N-[1-[2-(4-Butyryl-4-phenyl-piperidi...)
Affinity DataEC50:  2.90nM. Assay description: In vitro effective concentration towards human Melanocortin 4 receptor (MC4R) was determined by a SPA-based cAMP assay in melanoma cells
In DepthDetails ArticlePubMed
TargetMelanocyte-stimulating hormone receptor(Homo sapiens (Human))
Bristol-Myers Squibb Pharmaceutical Research Institute
Curated by ChEMBL
LigandPNGBDBM50125750(CHEMBL13910 | N-[1-[2-(4-Butyryl-4-phenyl-piperidi...)
Affinity DataEC50:  0.190nM. Assay description: In vitro inhibitory concentration against human Melanocortin 1 receptor (MC1R)
In DepthDetails ArticlePubMed