BDBM50125817 CHEMBL3623845
SMILES OC(=O)C\C(=C\c1cccc(c1)C(F)(F)F)c1nc2ccccc2o1
InChI Key InChIKey=VNOFISKYNVRSLE-WQLSENKSSA-N
Data  1 Kd
  Tab Delimited (TSV)   2D SDfile   Computed 3D by Vconf -m prep SDfile
Find this compound or compounds like it in BindingDB:
Activity Spreadsheet -- Enzyme Inhibition Constant Data from BindingDB
Found 1 hit for monomerid = 50125817
Target3-phosphoinositide-dependent protein kinase 1(Homo sapiens (Human))
Bioinformatics Institute (Bii)
Curated by ChEMBL
LigandPNGBDBM50125817(CHEMBL3623845)
Affinity DataKd: >2.00E+5nM. Assay description: Displacement of PIFtide from human PDK1 PIF pocket after 1 hr by fluorescence polarization assay
In DepthDetails ArticlePubMed