BDBM50125824 CHEMBL3623893
SMILES Cc1cc(ccn1)-c1ccc(SCC(=O)Nc2ccc(cn2)-c2cnccn2)cc1
InChI Key InChIKey=OGSRYQZSSXXEKO-UHFFFAOYSA-N
Data  1 IC50
  Tab Delimited (TSV)   2D SDfile   Computed 3D by Vconf -m prep SDfile
Find this compound or compounds like it in BindingDB:
Activity Spreadsheet -- Enzyme Inhibition Constant Data from BindingDB
Found 1 hit for monomerid = 50125824
TargetProtein-serine O-palmitoleoyltransferase porcupine(Homo sapiens (Human))
Soochow University
Curated by ChEMBL
LigandPNGBDBM50125824(CHEMBL3623893)
Affinity DataIC50:  0.530nM. Assay description: Inhibition of porcupine (unknown origin) expressed in mouse L Wnt3A cells co-cultured with TM3 cells harboring luciferase reporter gene assessed as r...
In DepthDetails ArticlePubMed