BDBM50125850 CHEMBL278282::Cyclohex-2-ene-1,2-dicarboxylic acid 1-(4-carbamimidoyl-benzylamide) 2-cyclohexylamide
SMILES NC(=N)c1ccc(CNC(=O)C2CCCC=C2C(=O)NC2CCCCC2)cc1
InChI Key InChIKey=UORPAZIWMLBTTP-UHFFFAOYSA-N
Data  1 IC50
  Tab Delimited (TSV)   2D SDfile   Computed 3D by Vconf -m prep SDfile
Find this compound or compounds like it in BindingDB:
Activity Spreadsheet -- Enzyme Inhibition Constant Data from BindingDB
Found 1 hit for monomerid = 50125850
TargetProthrombin(Homo sapiens (Human))
Link£Ping University
Curated by ChEMBL
LigandPNGBDBM50125850(CHEMBL278282 | Cyclohex-2-ene-1,2-dicarboxylic aci...)
Affinity DataIC50: >1.30E+5nM. Assay description: In vitro inhibitory concentration of compound against human thrombin
In DepthDetails ArticlePubMed