BDBM50125904 CHEMBL3623878
SMILES Cc1cc(ccn1)-c1cccc(SCC(=O)Nc2ccc(cn2)-c2cnccn2)c1
InChI Key InChIKey=NWTCVMKPMDPIIM-UHFFFAOYSA-N
Data  1 IC50
  Tab Delimited (TSV)   2D SDfile   Computed 3D by Vconf -m prep SDfile
Find this compound or compounds like it in BindingDB:
Activity Spreadsheet -- Enzyme Inhibition Constant Data from BindingDB
Found 1 hit for monomerid = 50125904
TargetProtein-serine O-palmitoleoyltransferase porcupine(Homo sapiens (Human))
Soochow University
Curated by ChEMBL
LigandPNGBDBM50125904(CHEMBL3623878)
Affinity DataIC50:  40nM. Assay description: Inhibition of porcupine (unknown origin) expressed in mouse L Wnt3A cells co-cultured with TM3 cells harboring luciferase reporter gene assessed as r...
In DepthDetails ArticlePubMed