BDBM50125941 CHEMBL3623875
SMILES Cc1cc(ccn1)-c1ccc(OC(=O)Nc2ccc(cn2)-c2cnccn2)cc1
InChI Key InChIKey=AQUPHPLXUVSULY-UHFFFAOYSA-N
Data  1 IC50
  Tab Delimited (TSV)   2D SDfile   Computed 3D by Vconf -m prep SDfile
Find this compound or compounds like it in BindingDB:
Activity Spreadsheet -- Enzyme Inhibition Constant Data from BindingDB
Found 1 hit for monomerid = 50125941
TargetProtein-serine O-palmitoleoyltransferase porcupine(Homo sapiens (Human))
Soochow University
Curated by ChEMBL
LigandPNGBDBM50125941(CHEMBL3623875)
Affinity DataIC50:  0.230nM. Assay description: Inhibition of porcupine (unknown origin) expressed in mouse L Wnt3A cells co-cultured with TM3 cells harboring luciferase reporter gene assessed as r...
In DepthDetails ArticlePubMed