BDBM50125957 CHEMBL3627861
SMILES NCCCCN(C[C@H]1CN(CCN1)S(=O)(=O)c1cc2ccccc2s1)[C@H]1CCCc2cccnc12
InChI Key InChIKey=MNNBALJLXVSZMB-GOTSBHOMSA-N
Data  1 IC50
  Tab Delimited (TSV)   2D SDfile   Computed 3D by Vconf -m prep SDfile
Find this compound or compounds like it in BindingDB:
Activity Spreadsheet -- Enzyme Inhibition Constant Data from BindingDB
Found 1 hit for monomerid = 50125957
TargetC-X-C chemokine receptor type 4(Homo sapiens (Human))
Emory Institute For Drug Development
Curated by ChEMBL
LigandPNGBDBM50125957(CHEMBL3627861)
Affinity DataIC50:  39nM. Assay description: Displacement of [125I]-SDF-1 from CXCR4 (unknown origin)
In DepthDetails ArticlePubMed