BDBM50126154 CHEMBL3629577
SMILES CC(C)Oc1ccc(cc1-n1c(CN2CCN(CC2)C(=O)COc2ccc(Cl)cc2)nc2ccccc2c1=O)C(=O)CF
InChI Key InChIKey=VQCANMVYTKWJNM-UHFFFAOYSA-N
Data  1 IC50
  Tab Delimited (TSV)   2D SDfile   Computed 3D by Vconf -m prep SDfile
Find this compound or compounds like it in BindingDB:
Activity Spreadsheet -- Enzyme Inhibition Constant Data from BindingDB
Found 1 hit for monomerid = 50126154
TargetCystine/glutamate transporter(Homo sapiens (Human))
Columbia University
Curated by ChEMBL
LigandPNGBDBM50126154(CHEMBL3629577)
Affinity DataIC50:  40nM. Assay description: Inhibition of Xct in human CCF-STTG1 cells assessed as glutamate release after 2 hrs by fluorometry
In DepthDetails ArticlePubMed