BDBM50126202 9-Allyl-9H-fluorene-9-carboxylic acid ethylamide::CHEMBL282860
SMILES CCNC(=O)C1(CC=C)c2ccccc2-c2ccccc12
InChI Key InChIKey=OLRCQLMZMRGGJR-UHFFFAOYSA-N
Data  1 IC50
  Tab Delimited (TSV)   2D SDfile   Computed 3D by Vconf -m prep SDfile
Find this compound or compounds like it in BindingDB:
Activity Spreadsheet -- Enzyme Inhibition Constant Data from BindingDB
Found 1 hit for monomerid = 50126202
TargetMicrosomal triglyceride transfer protein large subunit(Bos taurus)
Bristol-Myers Squibb Pharmaceutical Research Institute
Curated by ChEMBL
LigandPNGBDBM50126202(9-Allyl-9H-fluorene-9-carboxylic acid ethylamide |...)
Affinity DataIC50:  2.20E+3nM. Assay description: Inhibitory activity against microsomal triglyceride transfer protein (MTP)
In DepthDetails ArticlePubMed