BDBM50126210 CHEMBL25759::{4-[9-(4-Amino-benzylcarbamoyl)-9H-fluoren-9-yl]-butyl}-phosphonic acid dibutyl ester
SMILES CCCCOP(=O)(CCCCC1(C(=O)NCc2ccc(N)cc2)c2ccccc2-c2ccccc12)OCCCC
InChI Key InChIKey=FXAZXQCCNDKGKK-UHFFFAOYSA-N
Data  1 IC50
  Tab Delimited (TSV)   2D SDfile   Computed 3D by Vconf -m prep SDfile
Find this compound or compounds like it in BindingDB:
Activity Spreadsheet -- Enzyme Inhibition Constant Data from BindingDB
Found 1 hit for monomerid = 50126210
TargetMicrosomal triglyceride transfer protein large subunit(Bos taurus)
Bristol-Myers Squibb Pharmaceutical Research Institute
Curated by ChEMBL
LigandPNGBDBM50126210(CHEMBL25759 | {4-[9-(4-Amino-benzylcarbamoyl)-9H-f...)
Affinity DataIC50:  890nM. Assay description: Inhibitory activity against microsomal triglyceride transfer protein (MTP)
In DepthDetails ArticlePubMed