BDBM50126284 5-Bromo-isoquinolin-6-ylamine::CHEMBL27011
SMILES Nc1ccc2cnccc2c1Br
InChI Key InChIKey=JDEBLBVBKMBILY-UHFFFAOYSA-N
Data  1 IC50
  Tab Delimited (TSV)   2D SDfile   Computed 3D by Vconf -m prep SDfile
Find this compound or compounds like it in BindingDB:
Activity Spreadsheet -- Enzyme Inhibition Constant Data from BindingDB
Found 1 hit for monomerid = 50126284
TargetInosine-5'-monophosphate dehydrogenase 2(Homo sapiens (Human))
Bristol-Myers Squibb Pharmaceutical Research Institute
Curated by ChEMBL
LigandPNGBDBM50126284(5-Bromo-isoquinolin-6-ylamine | CHEMBL27011)
Affinity DataIC50:  550nM. Assay description: Inhibitory activity of the compound against inosine 5'-inosine monophosphate dehydrogenase type II (IMPDH II)
In DepthDetails ArticlePubMed