BDBM50126482 CHEMBL3628449
SMILES CCN1CCN(CCCOc2ccc(Nc3c(cnc4ccc(F)cc34)C(=O)NN)cc2)CC1
InChI Key InChIKey=NMVMMUABJVCFAH-UHFFFAOYSA-N
Data  1 IC50
  Tab Delimited (TSV)   2D SDfile   Computed 3D by Vconf -m prep SDfile
Find this compound or compounds like it in BindingDB:
Activity Spreadsheet -- Enzyme Inhibition Constant Data from BindingDB
Found 1 hit for monomerid = 50126482
TargetDNA gyrase subunit B(Mycobacterium smegmatis)
Birla Institute Of Technology
Curated by ChEMBL
LigandPNGBDBM50126482(CHEMBL3628449)
Affinity DataIC50:  2.92E+3nM. Assay description: Inhibition of Mycobacterium smegmatis DNA gyrase B expressed in Escherichia coli BL21 (DE3) pLysS cells assessed as reduction in ATPase activity incu...
In DepthDetails ArticlePubMed