BDBM50126514 2-{5-[(6-Amino-2-methyl-pyridin-3-ylmethyl)-carbamoyl]-1,3-dioxo-5,8-dihydro-[1,2,4]triazolo[1,2-a]pyridazin-2-yl}-3-(4-bromo-phenylsulfanyl)-propionic acid cyclohexyl ester::CHEMBL32203
SMILES Cc1nc(N)ccc1CNC(=O)C1C=CCn2n1c(=O)n(C(CSc1ccc(Br)cc1)C(=O)OC1CCCCC1)c2=O
InChI Key InChIKey=RXJRFIVHHNTFRH-UHFFFAOYSA-N
Data  1 KI
  Tab Delimited (TSV)   2D SDfile   Computed 3D by Vconf -m prep SDfile
Find this compound or compounds like it in BindingDB:
Activity Spreadsheet -- Enzyme Inhibition Constant Data from BindingDB
Found 1 hit for monomerid = 50126514
TargetProthrombin(Homo sapiens (Human))
Molecumetics
Curated by ChEMBL
LigandPNGBDBM50126514(2-{5-[(6-Amino-2-methyl-pyridin-3-ylmethyl)-carbam...)
Affinity DataKi:  1.5nM. Assay description: Inhibitory activity of the compound against human thrombin
In DepthDetails ArticlePubMed