BDBM50126645 3-[3-({[(Z)-amino(imino)methyl]amino}oxy)propoxy]-5-ethylphenyl 2-methylsulfonyl benzenesulfonate::CHEMBL433044
SMILES CCc1cc(OCCCONC(N)=N)cc(OS(=O)(=O)c2ccccc2S(C)(=O)=O)c1
InChI Key InChIKey=ZCRWDWTYYRDFMD-UHFFFAOYSA-N
Data  1 KI
  Tab Delimited (TSV)   2D SDfile   Computed 3D by Vconf -m prep SDfile
Find this compound or compounds like it in BindingDB:
Activity Spreadsheet -- Enzyme Inhibition Constant Data from BindingDB
Found 1 hit for monomerid = 50126645
TargetProthrombin(Homo sapiens (Human))
3-Dimensional Pharmaceuticals
Curated by ChEMBL
LigandPNGBDBM50126645(3-[3-({[(Z)-amino(imino)methyl]amino}oxy)propoxy]-...)
Affinity DataKi:  30nM. Assay description: Inhibitory activity of the compound was tested against alpha-human thrombin
In DepthDetails ArticlePubMed