BDBM50126834 CHEMBL3628354
SMILES CCOC(=O)c1cnc2ccc(cc2c1Nc1ccc(NCCCN2CCOCC2)cc1)C(F)(F)F
InChI Key InChIKey=ITQPSSHZDKJILG-UHFFFAOYSA-N
Data  1 IC50
  Tab Delimited (TSV)   2D SDfile   Computed 3D by Vconf -m prep SDfile
Find this compound or compounds like it in BindingDB:
Activity Spreadsheet -- Enzyme Inhibition Constant Data from BindingDB
Found 1 hit for monomerid = 50126834
TargetDNA gyrase subunit B(Mycobacterium smegmatis)
Birla Institute Of Technology
Curated by ChEMBL
LigandPNGBDBM50126834(CHEMBL3628354)
Affinity DataIC50:  6.62E+3nM. Assay description: Inhibition of Mycobacterium smegmatis DNA gyrase B expressed in Escherichia coli BL21 (DE3) pLysS cells assessed as reduction in ATPase activity incu...
In DepthDetails ArticlePubMed