BDBM50126839 CHEMBL3628349
SMILES CCOC(=O)c1cnc2ccc(F)cc2c1Nc1ccc(OCCCN2CCOCC2)cc1
InChI Key InChIKey=CCNRNNWYCOAITH-UHFFFAOYSA-N
Data  1 IC50
  Tab Delimited (TSV)   2D SDfile   Computed 3D by Vconf -m prep SDfile
Find this compound or compounds like it in BindingDB:
Activity Spreadsheet -- Enzyme Inhibition Constant Data from BindingDB
Found 1 hit for monomerid = 50126839
TargetDNA gyrase subunit B(Mycobacterium smegmatis)
Birla Institute Of Technology
Curated by ChEMBL
LigandPNGBDBM50126839(CHEMBL3628349)
Affinity DataIC50:  1.69E+4nM. Assay description: Inhibition of Mycobacterium smegmatis DNA gyrase B expressed in Escherichia coli BL21 (DE3) pLysS cells assessed as reduction in ATPase activity incu...
In DepthDetails ArticlePubMed