BDBM50126915 CHEMBL3629110::US10351558, Example 138
SMILES Cc1ccc2n3C[C@@](CCc3c(C(N)=O)c2c1)(NC(=O)c1ccc(cc1Cl)-n1cnnc1)c1ccccc1
InChI Key InChIKey=VMFPNMKJFRPSDG-GDLZYMKVSA-N
Data  2 KI  1 IC50
  Tab Delimited (TSV)   2D SDfile   Computed 3D by Vconf -m prep SDfile
Find this compound or compounds like it in BindingDB:
Activity Spreadsheet -- Enzyme Inhibition Constant Data from BindingDB
Found 3 hits for monomerid = 50126915
TargetCoagulation factor IX(Homo sapiens (Human))
Merck Research Laboratories
Curated by ChEMBL
LigandPNGBDBM50126915(CHEMBL3629110 | US10351558, Example 138)
Affinity DataKi:  2.60nM. Assay description: Inhibition of human F9a using CH3SO2-D-CHG-Gly-Arg-AFC.AcOH as substrate by fluorescence assay
In DepthDetails ArticlePubMed
TargetCoagulation factor X(Homo sapiens (Human))
Merck Research Laboratories
Curated by ChEMBL
LigandPNGBDBM50126915(CHEMBL3629110 | US10351558, Example 138)
Affinity DataKi:  1.04E+3nM. Assay description: Inhibition of human F10a using CH3SO2-D-CHG-Gly-Arg-AFC.AcOH as substrate by fluorescence assay
In DepthDetails ArticlePubMed
TargetCoagulation factor IX(Homo sapiens (Human))
Merck Research Laboratories
Curated by ChEMBL
LigandPNGBDBM50126915(CHEMBL3629110 | US10351558, Example 138)
Affinity DataIC50:  1.25nM. Assay description: TBD
In DepthDetails US Patent