BDBM50126920 CHEMBL3628829
SMILES Cc1ncn(n1)-c1cc(Cl)c(C(=O)N[C@]2(C)CCc3nn4c(C)ccc(O)c4c3C2)c(Cl)c1
InChI Key InChIKey=IRUQGJGQVYQAAP-HSZRJFAPSA-N
Data  2 KI
  Tab Delimited (TSV)   2D SDfile   Computed 3D by Vconf -m prep SDfile
Find this compound or compounds like it in BindingDB:
Activity Spreadsheet -- Enzyme Inhibition Constant Data from BindingDB
Found 2 hits for monomerid = 50126920
TargetCoagulation factor IX(Homo sapiens (Human))
Merck Research Laboratories
Curated by ChEMBL
LigandPNGBDBM50126920(CHEMBL3628829)
Affinity DataKi:  12nM. Assay description: Inhibition of human F9a using CH3SO2-D-CHG-Gly-Arg-AFC.AcOH as substrate by fluorescence assay
In DepthDetails ArticlePubMed
TargetCoagulation factor X(Homo sapiens (Human))
Merck Research Laboratories
Curated by ChEMBL
LigandPNGBDBM50126920(CHEMBL3628829)
Affinity DataKi:  2.26E+3nM. Assay description: Inhibition of human F10a using CH3SO2-D-CHG-Gly-Arg-AFC.AcOH as substrate by fluorescence assay
In DepthDetails ArticlePubMed