BDBM50126945 CHEMBL3628950
SMILES Cc1ncn(n1)-c1cc(Cl)c(C(=O)N[C@@]2(CCc3nn4cc(C)ccc4c3C2)c2cccc(c2)C(F)(F)F)c(Cl)c1
InChI Key InChIKey=FPQHMOYXJMVTPZ-MUUNZHRXSA-N
Data  2 KI
  Tab Delimited (TSV)   2D SDfile   Computed 3D by Vconf -m prep SDfile
Find this compound or compounds like it in BindingDB:
Activity Spreadsheet -- Enzyme Inhibition Constant Data from BindingDB
Found 2 hits for monomerid = 50126945
TargetCoagulation factor IX(Homo sapiens (Human))
Merck Research Laboratories
Curated by ChEMBL
LigandPNGBDBM50126945(CHEMBL3628950)
Affinity DataKi:  4.5nM. Assay description: Inhibition of human F9a using CH3SO2-D-CHG-Gly-Arg-AFC.AcOH as substrate by fluorescence assay
In DepthDetails ArticlePubMed
TargetCoagulation factor X(Homo sapiens (Human))
Merck Research Laboratories
Curated by ChEMBL
LigandPNGBDBM50126945(CHEMBL3628950)
Affinity DataKi:  1.55E+3nM. Assay description: Inhibition of human F10a using CH3SO2-D-CHG-Gly-Arg-AFC.AcOH as substrate by fluorescence assay
In DepthDetails ArticlePubMed