BDBM50127291 CHEMBL3628060
SMILES [Br-].Cc1ccc(C[n+]2ccc(cc2)C(=O)NCCc2c[nH]c3ccccc23)cc1
InChI Key InChIKey=NCADSSIAFOWQRE-UHFFFAOYSA-N
Data  2 IC50
  Tab Delimited (TSV)   2D SDfile   Computed 3D by Vconf -m prep SDfile
Find this compound or compounds like it in BindingDB:
Activity Spreadsheet -- Enzyme Inhibition Constant Data from BindingDB
Found 2 hits for monomerid = 50127291
TargetCholinesterase(Homo sapiens (Human))
1St Affiliated Hospital Of Guangxi Medical University
Curated by ChEMBL
LigandPNGBDBM50127291(CHEMBL3628060)
Affinity DataIC50:  8.90E+3nM. Assay description: Inhibition of human serum BuChE using S-butyrylthiocholine iodide as substrate preincubated for 5 mins followed by substrate addition by Ellman's met...
In DepthDetails ArticlePubMed
TargetAcetylcholinesterase(Homo sapiens (Human))
1St Affiliated Hospital Of Guangxi Medical University
Curated by ChEMBL
LigandPNGBDBM50127291(CHEMBL3628060)
Affinity DataIC50:  5.70E+3nM. Assay description: Inhibition of human recombinant AChE using acetylthiocholine iodide as substrate preincubated for 5 mins followed by substrate addition by Ellman's m...
In DepthDetails ArticlePubMed