BDBM50127723 CHEMBL3629708
SMILES Cc1cc(cc2cn[nH]c12)C(=O)N1CCC2(CN(C2)C(=O)OCC(C)(C)C)CC1
InChI Key InChIKey=IKLNWGFBOHSGIR-UHFFFAOYSA-N
Data  2 IC50
  Tab Delimited (TSV)   2D SDfile   Computed 3D by Vconf -m prep SDfile
Find this compound or compounds like it in BindingDB:
Activity Spreadsheet -- Enzyme Inhibition Constant Data from BindingDB
Found 2 hits for monomerid = 50127723
TargetAcetyl-CoA carboxylase 1(Rattus norvegicus (Rat))
Pfizer
Curated by ChEMBL
LigandPNGBDBM50127723(CHEMBL3629708)
Affinity DataIC50:  310nM. Assay description: Inhibition of rat liver ACC1 preincubated for 10 mins followed by acetyl-CoA/KHCO3/[14C]-NaHCO3/ATP addition measured after 20 mins by liquid scintil...
In DepthDetails ArticlePubMed
TargetAcetyl-CoA carboxylase 2(Homo sapiens (Human))
Pfizer
Curated by ChEMBL
LigandPNGBDBM50127723(CHEMBL3629708)
Affinity DataIC50:  1.40E+3nM. Assay description: Inhibition of recombinant human ACC2 expressed in CHO cells by fluorescence polarization assay
In DepthDetails ArticlePubMed