BDBM50127886 3-(4-Chloro-3-nitro-phenyl)-4,5-dihydro-isoxazole-5-carboxylic acid (2'-sulfamoyl-biphenyl-4-yl)-amide::CHEMBL50298
SMILES NS(=O)(=O)c1ccccc1-c1ccc(NC(=O)C2C[C+]([N-]O2)c2ccc(Cl)c(c2)[N+]([O-])=O)cc1
InChI Key InChIKey=SMOQZPYLCXSLGB-UHFFFAOYSA-N
Data  1 KI
  Tab Delimited (TSV)   2D SDfile   Computed 3D by Vconf -m prep SDfile
Find this compound or compounds like it in BindingDB:
Activity Spreadsheet -- Enzyme Inhibition Constant Data from BindingDB
Found 1 hit for monomerid = 50127886
TargetCoagulation factor X(Homo sapiens (Human))
Bristol-Myers Squibb
Curated by ChEMBL
LigandPNGBDBM50127886(3-(4-Chloro-3-nitro-phenyl)-4,5-dihydro-isoxazole-...)
Affinity DataKi: >3.00E+4nM. Assay description: Binding affinity against the Factor Xa (FXa)
In DepthDetails ArticlePubMed