BDBM50127890 3-p-Tolyl-4,5-dihydro-isoxazole-5-carboxylic acid (2'-sulfamoyl-biphenyl-4-yl)-amide::CHEMBL51785
SMILES Cc1ccc(cc1)C1=NOC(C1)C(=O)Nc1ccc(cc1)-c1ccccc1S(N)(=O)=O
InChI Key InChIKey=RWYRRHYQCAZVOQ-UHFFFAOYSA-N
Data  1 KI
  Tab Delimited (TSV)   2D SDfile   Computed 3D by Vconf -m prep SDfile
Find this compound or compounds like it in BindingDB:
Activity Spreadsheet -- Enzyme Inhibition Constant Data from BindingDB
Found 1 hit for monomerid = 50127890
TargetCoagulation factor X(Homo sapiens (Human))
Bristol-Myers Squibb
Curated by ChEMBL
LigandPNGBDBM50127890(3-p-Tolyl-4,5-dihydro-isoxazole-5-carboxylic acid ...)
Affinity DataKi:  2.10E+3nM. Assay description: Binding affinity against the Factor Xa (FXa)
In DepthDetails ArticlePubMed