BDBM50128315 CHEMBL300989::N-[1-(3,5-Dimethyl-benzoyl)-cycloheptyl]-3-methoxy-2-methyl-benzamide
SMILES COc1cccc(C(=O)NC2(CCCCCC2)C(=O)c2cc(C)cc(C)c2)c1C
InChI Key InChIKey=CBHFZMWINDELST-UHFFFAOYSA-N
Data  2 EC50
  Tab Delimited (TSV)   2D SDfile   Computed 3D by Vconf -m prep SDfile
Find this compound or compounds like it in BindingDB:
Activity Spreadsheet -- Enzyme Inhibition Constant Data from BindingDB
Found 2 hits for monomerid = 50128315
TargetEcdysone receptor(Choristoneura fumiferana)
Rheogene
Curated by ChEMBL
LigandPNGBDBM50128315(CHEMBL300989 | N-[1-(3,5-Dimethyl-benzoyl)-cyclohe...)
Affinity DataEC50:  2.97E+3nM. Assay description: Dose affording 50% of maximum transactivation for ecdysone receptor from Choristoneura fumiferana (CfEcR) and a luciferase reporter gene in CHO cells
In DepthDetails ArticlePubMed
TargetEcdysone receptor(Bombyx mori)
Rheogene
Curated by ChEMBL
LigandPNGBDBM50128315(CHEMBL300989 | N-[1-(3,5-Dimethyl-benzoyl)-cyclohe...)
Affinity DataEC50:  1.61E+3nM. Assay description: Dose affording 50% of maximum transactivation for ecdysone receptor from Bombyx mori (BmEcR) and a beta-galactosidase reporter gene in HEK-293 cell-l...
In DepthDetails ArticlePubMed