BDBM50128341 CHEMBL3629174
SMILES N#Cc1ccnc(Nc2cn(C3CCN(CC3)C3COC3)c(n2)C2CCCC2)c1
InChI Key InChIKey=DJRNYYYLLGVMGL-UHFFFAOYSA-N
Data  1 KI
  Tab Delimited (TSV)   2D SDfile   Computed 3D by Vconf -m prep SDfile
Find this compound or compounds like it in BindingDB:
Activity Spreadsheet -- Enzyme Inhibition Constant Data from BindingDB
Found 1 hit for monomerid = 50128341
TargetMitogen-activated protein kinase kinase kinase 12(Homo sapiens (Human))
Wuxi Apptec
Curated by ChEMBL
LigandPNGBDBM50128341(CHEMBL3629174)
Affinity DataKi: >1.60E+3nM. Assay description: Inhibition of N-terminally GST- tagged human DLK catalytic domain (1 to 520 amino acids) using N-terminally HIS-tagged MKK4 K131M as substrate incuba...
In DepthDetails ArticlePubMed