BDBM50128347 CHEMBL3629341
SMILES [H][C@@]12CN(C[C@]1([H])C(Br)=NO2)C(=O)[C@H](CC(C)C)NC(=O)OCC=C
InChI Key InChIKey=VGSULLNOTWOPAJ-SDDRHHMPSA-N
Data  1 KI
  Tab Delimited (TSV)   2D SDfile   Computed 3D by Vconf -m prep SDfile
Find this compound or compounds like it in BindingDB:
Activity Spreadsheet -- Enzyme Inhibition Constant Data from BindingDB
Found 1 hit for monomerid = 50128347
TargetCysteine protease(Trypanosoma brucei rhodesiense)
University Of Messina
Curated by ChEMBL
LigandPNGBDBM50128347(CHEMBL3629341)
Affinity DataKi:  8.52E+3nM. Assay description: Inhibition of Trypanosoma brucei rhodesiense rhodesain using Cbz-Phe-Arg-7-amino-4-methylcoumarin assessed as substrate hydrolysis measured by fluore...
In DepthDetails ArticlePubMed