BDBM50128375 2-{1-[(S)-2-Hydroxy-3-(1H-indol-4-yloxy)-propyl]-piperidin-4-yl}-benzo[b]thiophen-7-ol::CHEMBL301272
SMILES O[C@H](COc1cccc2[nH]ccc12)CN1CCC(CC1)c1cc2cccc(O)c2s1
InChI Key InChIKey=LKRVLHRSQXBLNK-SFHVURJKSA-N
Data  2 KI
  Tab Delimited (TSV)   2D SDfile   Computed 3D by Vconf -m prep SDfile
Find this compound or compounds like it in BindingDB:
Activity Spreadsheet -- Enzyme Inhibition Constant Data from BindingDB
Found 2 hits for monomerid = 50128375
Target5-hydroxytryptamine receptor 1A(Homo sapiens (Human))
Eli Lilly
Curated by ChEMBL
LigandPNGBDBM50128375(2-{1-[(S)-2-Hydroxy-3-(1H-indol-4-yloxy)-propyl]-p...)
Affinity DataKi:  7.10nM. Assay description: Binding affinity was determined towards 5-hydroxytryptamine 1A receptor receptor using [3H]-8-OH-DPAT as radioligand
In DepthDetails ArticlePubMed
TargetSodium-dependent serotonin transporter(Rattus norvegicus (rat))
Eli Lilly
Curated by ChEMBL
LigandPNGBDBM50128375(2-{1-[(S)-2-Hydroxy-3-(1H-indol-4-yloxy)-propyl]-p...)
Affinity DataKi:  37nM. Assay description: Binding affinity towards serotonin [5-HT] reuptake site labeled with [3H]-paroxetine as radioligand
In DepthDetails ArticlePubMed