BDBM50128385 (S)-1-(1H-Indol-4-yloxy)-3-[4-(6-methoxy-benzo[b]thiophen-2-yl)-piperidin-1-yl]-propan-2-ol::CHEMBL57277
SMILES COc1ccc2cc(sc2c1)C1CCN(C[C@H](O)COc2cccc3[nH]ccc23)CC1
InChI Key InChIKey=DERHXBLKPZEOPV-IBGZPJMESA-N
Data  2 KI
  Tab Delimited (TSV)   2D SDfile   Computed 3D by Vconf -m prep SDfile
Find this compound or compounds like it in BindingDB:
Activity Spreadsheet -- Enzyme Inhibition Constant Data from BindingDB
Found 2 hits for monomerid = 50128385
Target5-hydroxytryptamine receptor 1A(Homo sapiens (Human))
Eli Lilly
Curated by ChEMBL
LigandPNGBDBM50128385((S)-1-(1H-Indol-4-yloxy)-3-[4-(6-methoxy-benzo[b]t...)
Affinity DataKi:  3.10nM. Assay description: Binding affinity of the compound was determined towards 5-hydroxytryptamine 1A receptor using [3H]-8-OH-DPAT as radioligand
In DepthDetails ArticlePubMed
TargetSodium-dependent serotonin transporter(Rattus norvegicus (rat))
Eli Lilly
Curated by ChEMBL
LigandPNGBDBM50128385((S)-1-(1H-Indol-4-yloxy)-3-[4-(6-methoxy-benzo[b]t...)
Affinity DataKi:  69nM. Assay description: Binding affinity towards Serotonin transporter labeled with [3H]-paroxetine as radioligand
In DepthDetails ArticlePubMed