BDBM50128452 6,7-Dihydroxy-1-[hydroxy-(2,4,6-trimethyl-phenyl)-methyl]-isoquinoline-3-carboxylic acid::CHEMBL294258
SMILES Cc1cc(C)c(C(O)c2nc(cc3cc(O)c(O)cc23)C(O)=O)c(C)c1
InChI Key InChIKey=DFXPACOPQZCCMY-UHFFFAOYSA-N
Data  1 KI
  Tab Delimited (TSV)   2D SDfile   Computed 3D by Vconf -m prep SDfile
Find this compound or compounds like it in BindingDB:
Activity Spreadsheet -- Enzyme Inhibition Constant Data from BindingDB
Found 1 hit for monomerid = 50128452
TargetInsulin-like growth factor-binding protein 3(Homo sapiens (Human))
Neurocrine Biosciences
Curated by ChEMBL
LigandPNGBDBM50128452(6,7-Dihydroxy-1-[hydroxy-(2,4,6-trimethyl-phenyl)-...)
Affinity DataKi:  11nM. Assay description: Ability to displace Insulin-Like Growth Factor (IGF-I) from its binding to human insulin-like growth factor binding protein 3 (hIGFBP-3)
In DepthDetails ArticlePubMed