BDBM50128475 (3-Fluoro-phenyl)-((2R,4S)-2-methyl-4-phenylamino-3,4-dihydro-2H-quinolin-1-yl)-methanone::CHEMBL57946
SMILES C[C@@H]1C[C@H](Nc2ccccc2)c2ccccc2N1C(=O)c1cccc(F)c1
InChI Key InChIKey=USNGTWIJXFTREV-IERDGZPVSA-N
Data  1 EC50
  Tab Delimited (TSV)   2D SDfile   Computed 3D by Vconf -m prep SDfile
Find this compound or compounds like it in BindingDB:
Activity Spreadsheet -- Enzyme Inhibition Constant Data from BindingDB
Found 1 hit for monomerid = 50128475
TargetEcdysone receptor(Aedes aegypti)
Rheogene
Curated by ChEMBL
LigandPNGBDBM50128475((3-Fluoro-phenyl)-((2R,4S)-2-methyl-4-phenylamino-...)
Affinity DataEC50:  750nM. Assay description: Effective concentration for ecdysone-dependent transactivation in mammalian cell line expressing Aedes aegypti ecdysone receptor
In DepthDetails ArticlePubMed